Reaction Details
TargetNuclear receptor ROR-gamma
LigandBDBM359510
Substrate/Competitorn/a
Meas. Tech.Biological Assay
IC50 1.000±n/a nM
Citation Lapointe, BTFuller, PHGunaydin, HLiu, KSciammetta, NTrotter, BWZhang, HBarr, KJMaclean, JKMolinari, DFSimov, V Substituted pyrazole compounds as RORgammaT inhibitors and uses thereof US Patent US10221142 Publication Date 3/5/2019
 
Nuclear receptor ROR-gamma
Name:Nuclear receptor ROR-gamma
Type:Enzyme Catalytic Domain
Mol. Mass.:58218.40
Organism:Homo sapiens (Human)
Description:P51449
Residue:518
BDBM359510
NameBDBM359510
Synonyms:4-(1-(2-chloro-6- cyclopropylbenzoyl)- 6-(3- methoxyazetidine-1- carbonyl)-4,5,6,7- tetrahydro-1H- indazol-3-yl)-3- fluorobenzoic acid US10221142, Example 12A-B
TypeSmall organic molecule
Emp. Form.C29H27ClFN3O5
Mol. Mass.551.993
SMILESCOC1CN(C1)C(=O)C1CCc2c(C1)n(nc2-c1ccc(cc1F)C(O)=O)C(=O)c1c(Cl)cccc1C1CC1