Reaction Details
TargetNuclear receptor ROR-gamma
LigandBDBM359535
Substrate/Competitorn/a
Meas. Tech.Biological Assay
IC50 0.700±n/a nM
Citation Lapointe, BTFuller, PHGunaydin, HLiu, KSciammetta, NTrotter, BWZhang, HBarr, KJMaclean, JKMolinari, DFSimov, V Substituted pyrazole compounds as RORgammaT inhibitors and uses thereof US Patent US10221142 Publication Date 3/5/2019
 
Nuclear receptor ROR-gamma
Name:Nuclear receptor ROR-gamma
Type:Enzyme Catalytic Domain
Mol. Mass.:58218.40
Organism:Homo sapiens (Human)
Description:P51449
Residue:518
BDBM359535
NameBDBM359535
Synonyms:US10221142, Example 21A
TypeSmall organic molecule
Emp. Form.C32H28ClF4N3O5
Mol. Mass.646.028
SMILESOC(=O)c1ccc(-c2nn(C(=O)c3c(Cl)cccc3C3(CC3)C(F)(F)F)c3CC(CCc23)C(=O)N2CCC3(COC3)C2)c(F)c1