Reaction Details
TargetNuclear receptor ROR-gamma
LigandBDBM359550
Substrate/Competitorn/a
Meas. Tech.Biological Assay
IC50 0.800±n/a nM
Citation Lapointe, BTFuller, PHGunaydin, HLiu, KSciammetta, NTrotter, BWZhang, HBarr, KJMaclean, JKMolinari, DFSimov, V Substituted pyrazole compounds as RORgammaT inhibitors and uses thereof US Patent US10221142 Publication Date 3/5/2019
 
Nuclear receptor ROR-gamma
Name:Nuclear receptor ROR-gamma
Type:Enzyme Catalytic Domain
Mol. Mass.:58218.40
Organism:Homo sapiens (Human)
Description:P51449
Residue:518
BDBM359550
NameBDBM359550
Synonyms:4-[(6R or S)-1-({2- chloro-6-[1- (difluoromethyl)cyclo propyl]phenyl}car- bonyl)-6-(2-oxa-6- azaspiro[3.4]oct-6- ylcarbonyl)-4,5,6,7- tetrahydro-1H- indazol-3-yl]-3- fluorobenzoic acid | US10221142, Example 21P
TypeSmall organic molecule
Emp. Form.C32H29ClF3N3O5
Mol. Mass.628.038
SMILESOC(=O)c1ccc(-c2nn(C(=O)c3c(Cl)cccc3C3(CC3)C(F)F)c3CC(CCc23)C(=O)N2CCC3(COC3)C2)c(F)c1