Reaction Details
TargetNuclear receptor ROR-gamma
LigandBDBM359557
Substrate/Competitorn/a
Meas. Tech.Biological Assay
IC50 1.000±n/a nM
Citation Lapointe, BTFuller, PHGunaydin, HLiu, KSciammetta, NTrotter, BWZhang, HBarr, KJMaclean, JKMolinari, DFSimov, V Substituted pyrazole compounds as RORgammaT inhibitors and uses thereof US Patent US10221142 Publication Date 3/5/2019
 
Nuclear receptor ROR-gamma
Name:Nuclear receptor ROR-gamma
Type:Enzyme Catalytic Domain
Mol. Mass.:58218.40
Organism:Homo sapiens (Human)
Description:P51449
Residue:518
BDBM359557
NameBDBM359557
Synonyms:(R or S)-4-(1-(2- chloro-6-(1- (trifluoromethyl)cyclo- propyl)benzoyl)-6- (((1-isopropyl-1H- pyrazol-4- yl)methyl)(methyl)car- bamoyl)-4,5,6,7- tetrahydro-1H- indazol-3-yl)-3- fluorobenzoic acid | US10221142, Example 21W
TypeSmall organic molecule
Emp. Form.C34H32ClF4N5O4
Mol. Mass.686.096
SMILESCC(C)n1cc(CN(C)C(=O)C2CCc3c(C2)n(nc3-c2ccc(cc2F)C(O)=O)C(=O)c2c(Cl)cccc2C2(CC2)C(F)(F)F)cn1