Reaction Details
TargetNuclear receptor ROR-gamma
LigandBDBM359568
Substrate/Competitorn/a
Meas. Tech.Biological Assay
IC50 0.500±n/a nM
Citation Lapointe, BTFuller, PHGunaydin, HLiu, KSciammetta, NTrotter, BWZhang, HBarr, KJMaclean, JKMolinari, DFSimov, V Substituted pyrazole compounds as RORgammaT inhibitors and uses thereof US Patent US10221142 Publication Date 3/5/2019
 
Nuclear receptor ROR-gamma
Name:Nuclear receptor ROR-gamma
Type:Enzyme Catalytic Domain
Mol. Mass.:58218.40
Organism:Homo sapiens (Human)
Description:P51449
Residue:518
BDBM359568
NameBDBM359568
Synonyms:(R or S)-4-(1-(2- chloro-6-(1- (trifluoromethyl)cyclo- propyl)benzoyl)-6- (2-methyl-4,5,6,7- tetrahydro-2H- pyrazolo[4,3- c]pyridine-5- carbonyl)-4,5,6,7- tetrahydro-1H- indazol-3-yl)-3- fluorobenzoic acid | US10221142, Example 21HH
TypeSmall organic molecule
Emp. Form.C33H28ClF4N5O4
Mol. Mass.670.053
SMILESCn1cc2CN(CCc2n1)C(=O)C1CCc2c(C1)n(nc2-c1ccc(cc1F)C(O)=O)C(=O)c1c(Cl)cccc1C1(CC1)C(F)(F)F