Reaction Details
TargetNuclear receptor ROR-gamma
LigandBDBM359584
Substrate/Competitorn/a
Meas. Tech.Biological Assay
IC50 0.900±n/a nM
Citation Lapointe, BTFuller, PHGunaydin, HLiu, KSciammetta, NTrotter, BWZhang, HBarr, KJMaclean, JKMolinari, DFSimov, V Substituted pyrazole compounds as RORgammaT inhibitors and uses thereof US Patent US10221142 Publication Date 3/5/2019
 
Nuclear receptor ROR-gamma
Name:Nuclear receptor ROR-gamma
Type:Enzyme Catalytic Domain
Mol. Mass.:58218.40
Organism:Homo sapiens (Human)
Description:P51449
Residue:518
BDBM359584
NameBDBM359584
Synonyms:(R or S)-4-(1-(2- chloro-6-(1- (trifluoromethyl)cyclo- propyl)benzoyl)-6- (3-fluoro-[1,3'- biazetidine]-1'- carbonyl)-4,5,6,7- tetrahydro-1H- indazol-3-yl)-3- fluorobenzoic acid | US10221142, Example 21YY
TypeSmall organic molecule
Emp. Form.C32H28ClF5N4O4
Mol. Mass.663.034
SMILESOC(=O)c1ccc(-c2nn(C(=O)c3c(Cl)cccc3C3(CC3)C(F)(F)F)c3CC(CCc23)C(=O)N2CC(C2)N2CC(F)C2)c(F)c1