Reaction Details
TargetThymidylate synthase
LigandBDBM18753
Substrate/CompetitorBDBM18754
Meas. Tech.Thymidylate Synthase (TS) Assay
pH7.4±n/a
Temperature293.15±n/a K
Ki>245000±n/a nM
Citation Finer-Moore, JSAnderson, ACO'Neil, RHCosti, MPFerrari, SKrucinski, JStroud, RM The structure of Cryptococcus neoformans thymidylate synthase suggests strategies for using target dynamics for species-specific inhibition. Acta Crystallogr D Biol Crystallogr61:1320-34 (2005) 
 
Thymidylate synthase
Name:Thymidylate synthase
Type:Enzyme
Mol. Mass.:35718.07
Organism:Homo sapiens (Human)
Description:n/a
Residue:313
BDBM18753
BDBM18754
NameBDBM18753
Synonyms:4,4-bis(3-bromo-4-hydroxyphenyl)-10-chloro-3-oxatricyclo[7.3.1.0^{5,13}]trideca-1(12),5(13),6,8,10-pentaen-2-one | GA9
TypeSmall organic molecule
Emp. Form.C24H13Br2ClO4
Mol. Mass.560.619
SMILESOc1ccc(cc1Br)C1(OC(=O)c2ccc(Cl)c3cccc1c23)c1ccc(O)c(Br)c1