Reaction Details
TargetThyroid hormone receptor beta
LigandBDBM18863
Substrate/CompetitorBDBM18860
Meas. Tech.TRbeta-Binding Assay
pH7±n/a
Temperature277.15±n/a K
IC50 0.11±n/a nM
Citation Ye, LLi, YLMellström, KMellin, CBladh, LGKoehler, KGarg, NGarcia Collazo, AMLitten, CHusman, BPersson, KLjunggren, JGrover, GSleph, PGGeorge, RMalm, J Thyroid receptor ligands. 1. Agonist ligands selective for the thyroid receptor beta1. J Med Chem46:1580-8 (2003) 
 
Thyroid hormone receptor beta
Name:Thyroid hormone receptor beta
Type:Receptor
Mol. Mass.:52793.62
Organism:Homo sapiens (Human)
Description:Recombinant hThR was obtained from nuclear extracts from SF9 cells infected with baculovirus vectors encoding for ThRbeta 1.
Residue:461
BDBM18863
BDBM18860
NameBDBM18863
Synonyms:(2R)-2-amino-3-{4-[4-hydroxy-3-(propan-2-yl)phenoxy]-3,5-diiodophenyl}propanoic acid | diiodo isopropyl thyronine, 4
TypeSmall organic molecule
Emp. Form.C18H19I2NO4
Mol. Mass.567.1567
SMILESCC(C)c1cc(Oc2c(I)cc(C[C@@H](N)C(O)=O)cc2I)ccc1O