Reaction Details
TargetAndrogen receptor
LigandBDBM18161
Substrate/CompetitorBDBM26258
Meas. Tech.Competitive Radioligand Displacement Assay
pH7.4±n/a
Temperature277.15±n/a K
Ki 0.43±0.01 nM
Citation Hwang, DJYang, JXu, HRakov, IMMohler, MLDalton, JTMiller, DD Arylisothiocyanato selective androgen receptor modulators (SARMs) for prostate cancer. Bioorg Med Chem14:6525-38 (2006) 
 
Androgen receptor
Name:Androgen receptor
Type:Enzyme
Mol. Mass.:98219.08
Organism:Rattus norvegicus (Rat)
Description:P15207
Residue:902
BDBM18161
BDBM26258
NameBDBM18161
Synonyms:(1S,2S,7S,10R,11S,14S,15S)-14-hydroxy-2,15-dimethyltetracyclo[8.7.0.0^{2,7}.0^{11,15}]heptadecan-5-one CHEMBL27769 Dihydrotestosterone | [3H]DHT
TypeSteroid
Emp. Form.C19H30O2
Mol. Mass.290.4403
SMILES[H][C@@]12CC[C@H](O)[C@@]1(C)CC[C@@]1([H])[C@@]2([H])CC[C@@]2([H])CC(=O)CC[C@]12C