Reaction Details
TargetAndrogen receptor
LigandBDBM19244
Substrate/CompetitorBDBM26258
Meas. Tech.Competitive Radioligand Displacement Assay
pH7.4±n/a
Temperature277.15±n/a K
Ki 8.6±0.9 nM
CommentsIC50=52000 +/- 15300 for inhibiting growth of prostate cancer cell line, LNCaP.
Citation Hwang, DJYang, JXu, HRakov, IMMohler, MLDalton, JTMiller, DD Arylisothiocyanato selective androgen receptor modulators (SARMs) for prostate cancer. Bioorg Med Chem14:6525-38 (2006) 
 
Androgen receptor
Name:Androgen receptor
Type:Enzyme
Mol. Mass.:98219.08
Organism:Rattus norvegicus (Rat)
Description:P15207
Residue:902
BDBM19244
BDBM26258
NameBDBM19244
Synonyms:(2S)-3-(3-chloro-4-isothiocyanatophenoxy)-N-[4-cyano-3-(trifluoromethyl)phenyl]-2-hydroxy-2-methylpropanamide | arylisothiocyanato derivative, S-28
TypeSmall organic molecule
Emp. Form.C19H13ClF3N3O3S
Mol. Mass.455.838
SMILESC[C@](O)(COc1ccc(N=C=S)c(Cl)c1)C(=O)Nc1ccc(C#N)c(c1)C(F)(F)F