Reaction Details
TargetAndrogen receptor
LigandBDBM19245
Substrate/CompetitorBDBM26258
Meas. Tech.Competitive Radioligand Displacement Assay
pH7.4±n/a
Temperature277.15±n/a K
Ki 34.6±6.5 nM
CommentsIC50=23800 +/- 2000 for inhibiting growth of prostate cancer cell line, LNCaP.
Citation Hwang, DJYang, JXu, HRakov, IMMohler, MLDalton, JTMiller, DD Arylisothiocyanato selective androgen receptor modulators (SARMs) for prostate cancer. Bioorg Med Chem14:6525-38 (2006) 
 
Androgen receptor
Name:Androgen receptor
Type:Enzyme
Mol. Mass.:98219.08
Organism:Rattus norvegicus (Rat)
Description:P15207
Residue:902
BDBM19245
BDBM26258
NameBDBM19245
Synonyms:(2S)-3-(2-fluoro-4-isothiocyanatophenoxy)-2-hydroxy-2-methyl-N-[4-nitro-3-(trifluoromethyl)phenyl]propanamide | arylisothiocyanato derivative, S-29
TypeSmall organic molecule
Emp. Form.C18H13F4N3O5S
Mol. Mass.459.372
SMILESC[C@](O)(COc1ccc(cc1F)N=C=S)C(=O)Nc1ccc(c(c1)C(F)(F)F)[N+]([O-])=O