Reaction Details
TargetAndrogen receptor
LigandBDBM18695
Substrate/CompetitorBDBM26258
Meas. Tech.Competitive Radioligand Displacement Assay
pH7.4±n/a
Temperature277.15±n/a K
Ki 430±13 nM
CommentsIC50=64000 +/- 5900 for inhibiting growth of prostate cancer cell line, LNCaP.
Citation Hwang, DJYang, JXu, HRakov, IMMohler, MLDalton, JTMiller, DD Arylisothiocyanato selective androgen receptor modulators (SARMs) for prostate cancer. Bioorg Med Chem14:6525-38 (2006) 
 
Androgen receptor
Name:Androgen receptor
Type:Enzyme
Mol. Mass.:98219.08
Organism:Rattus norvegicus (Rat)
Description:P15207
Residue:902
BDBM18695
BDBM26258
NameBDBM18695
Synonyms:(2S)-N-[4-cyano-3-(trifluoromethyl)phenyl]-2-hydroxy-3-[(4-isothiocyanatophenyl)sulfanyl]-2-methylpropanamide Bicalutamide Analogue, (S)-7
TypeSmall organic molecule
Emp. Form.C19H14F3N3O2S2
Mol. Mass.437.459
SMILESC[C@@](O)(CSc1ccc(cc1)N=C=S)C(=O)Nc1ccc(C#N)c(c1)C(F)(F)F