Reaction Details
TargetCathepsin S
LigandBDBM19665
Substrate/CompetitorBDBM19546
Meas. Tech.Enzyme Inhibition Assay
pH5.5±n/a
Temperature310.15±n/a K
Ki 25±n/a nM
Citation Chatterjee, AKLiu, HTully, DCGuo, JEpple, RRusso, RWilliams, JRoberts, MTuntland, TChang, JGordon, PHollenbeck, TTumanut, CLi, JHarris, JL Synthesis and SAR of succinamide peptidomimetic inhibitors of cathepsin S. Bioorg Med Chem Lett17:2899-903 (2007) 
 
Cathepsin S
Name:Cathepsin S
Type:Protein
Mol. Mass.:37507.38
Organism:Homo sapiens (Human)
Description:P25774
Residue:331
BDBM19665
BDBM19546
NameBDBM19665
Synonyms:(2S)-N-[(2S)-3-methyl-1-{[4-(trifluoromethoxy)phenyl]amino}butan-2-yl]-4-(morpholin-4-yl)-4-oxo-2-phenylbutanamide | succinamide peptidomimetic, 31
TypeSmall organic molecule
Emp. Form.C26H32F3N3O4
Mol. Mass.507.5452
SMILESCC(C)[C@@H](CNc1ccc(OC(F)(F)F)cc1)NC(=O)[C@@H](CC(=O)N1CCOCC1)c1ccccc1