Reaction Details
TargetPhosphatidylinositol 4,5-bisphosphate 3-kinase catalytic subunit delta isoform
LigandBDBM362690
Substrate/Competitorn/a
Meas. Tech.Biochemical Assay
IC50 7.00±n/a nM
Citation Du, ZHintermann, SHurth, KJacquier, SLehmann, HMoebitz, HSoldermann, NStojanovic, A Substituted quinazolin-4-one derivatives US Patent US9840498 Publication Date 12/12/2017
 
Phosphatidylinositol 4,5-bisphosphate 3-kinase catalytic subunit delta isoform
Name:Phosphatidylinositol 4,5-bisphosphate 3-kinase catalytic subunit delta isoform
Type:Enzyme Subunit
Mol. Mass.:119489.41
Organism:Homo sapiens (Human)
Description:O00329
Residue:1044
BDBM362690
NameBDBM362690
Synonyms:US9840498, 16
TypeSmall organic molecule
Emp. Form.C28H25N9O2
Mol. Mass.519.5572
SMILESCc1nc(N)nc(N2C[C@@H](O)C[C@H]2c2nc3cccc(-c4cnn(C)c4)c3c(=O)n2-c2ccccc2)c1C#N