Reaction Details
TargetPhosphatidylinositol 4,5-bisphosphate 3-kinase catalytic subunit delta isoform
LigandBDBM362705
Substrate/Competitorn/a
Meas. Tech.Biochemical Assay
IC50 5.00±n/a nM
Citation Du, ZHintermann, SHurth, KJacquier, SLehmann, HMoebitz, HSoldermann, NStojanovic, A Substituted quinazolin-4-one derivatives US Patent US9840498 Publication Date 12/12/2017
 
Phosphatidylinositol 4,5-bisphosphate 3-kinase catalytic subunit delta isoform
Name:Phosphatidylinositol 4,5-bisphosphate 3-kinase catalytic subunit delta isoform
Type:Enzyme Subunit
Mol. Mass.:119489.41
Organism:Homo sapiens (Human)
Description:O00329
Residue:1044
BDBM362705
NameBDBM362705
Synonyms:US9840498, 32
TypeSmall organic molecule
Emp. Form.C30H27N9O2
Mol. Mass.545.5945
SMILESCCOc1ncc(cn1)-c1cccc2nc([C@@H]3CCCN3c3nc(N)nc(C)c3C#N)n(-c3ccccc3)c(=O)c12