Reaction Details
TargetPhosphatidylinositol 4,5-bisphosphate 3-kinase catalytic subunit delta isoform
LigandBDBM362706
Substrate/Competitorn/a
Meas. Tech.Biochemical Assay
IC50 13.0±n/a nM
Citation Du, ZHintermann, SHurth, KJacquier, SLehmann, HMoebitz, HSoldermann, NStojanovic, A Substituted quinazolin-4-one derivatives US Patent US9840498 Publication Date 12/12/2017
 
Phosphatidylinositol 4,5-bisphosphate 3-kinase catalytic subunit delta isoform
Name:Phosphatidylinositol 4,5-bisphosphate 3-kinase catalytic subunit delta isoform
Type:Enzyme Subunit
Mol. Mass.:119489.41
Organism:Homo sapiens (Human)
Description:O00329
Residue:1044
BDBM362706
NameBDBM362706
Synonyms:US9840498, 33
TypeSmall organic molecule
Emp. Form.C26H21N7O2
Mol. Mass.463.4906
SMILESNc1ncnc(N2CCC[C@H]2c2nc3cccc(C#CCO)c3c(=O)n2-c2ccccc2)c1C#N