Reaction Details
TargetThymidine phosphorylase
LigandBDBM20055
Substrate/CompetitorBDBM1
Meas. Tech.Enzyme Inhibition Assay
pH6.4±n/a
Temperature310.15±n/a K
Ki 5810±820 nM
Km121000±19000 nM
CommentsData was taken from Org. Prep. Proc. Int. 1993, 25, 563-568.
Citation Nencka, RVotruba, IHrebabecký, HJansa, PTloust'ova, EHorska, KMasojídkova, MHolý, A Discovery of 5-Substituted-6-chlorouracils as Efficient Inhibitors of Human Thymidine Phosphorylase. J Med Chem50:6016-23 (2007) 
 
Thymidine phosphorylase
Name:Thymidine phosphorylase
Type:Enzyme
Mol. Mass.:49948.87
Organism:Homo sapiens (Human)
Description:The recombinant human thymidine phosphorylase (V79TP) was expressed in V79 Chinese hamster cells (Sigma, T-9319).
Residue:482
BDBM20055
BDBM1
NameBDBM20055
Synonyms:5-Substituted-6-chlorouracil, 5b | 6-chloro-5-propyl-1,2,3,4-tetrahydropyrimidine-2,4-dione
TypeSmall organic molecule
Emp. Form.C7H9ClN2O2
Mol. Mass.188.612
SMILESCCCc1c(Cl)[nH]c(=O)[nH]c1=O