Reaction Details
TargetTransient receptor potential cation channel subfamily V member 1
LigandBDBM20458
Substrate/CompetitorBDBM20458
Meas. Tech.Radioligand Binding Assay and Antagonist Ca2+ Influx Functional Assay
pH7.4±n/a
Temperature298.15±n/a K
Ki 7±1 nM
EC50 5±2 nM
Citation Bianchi, BREl Kouhen, RNeelands, TRLee, CHGomtsyan, ARaja, SNVaidyanathan, SNSurber, BMcDonald, HASurowy, CSFaltynek, CRMoreland, RBJarvis, MFPuttfarcken, PS [3H]A-778317 [1-((R)-5-tert-butyl-indan-1-yl)-3-isoquinolin-5-yl-urea]: a novel, stereoselective, high-affinity antagonist is a useful radioligand for the human transient receptor potential vanilloid-1 (TRPV1) receptor. J Pharmacol Exp Ther323:285-93 (2007) 
 
Transient receptor potential cation channel subfamily V member 1
Name:Transient receptor potential cation channel subfamily V member 1
Type:Protein
Mol. Mass.:94960.75
Organism:Homo sapiens (Human)
Description:Q8NER1
Residue:839
BDBM20458
BDBM20458
NameBDBM20458
Synonyms:1-[(1R)-5-tert-butyl-2,3-dihydro-1H-inden-1-yl]-3-isoquinolin-5-ylurea A-778317 [3H] A-778317
TypeSmall organic molecule
Emp. Form.C23H25N3O
Mol. Mass.359.4641
SMILESCC(C)(C)c1ccc2[C@@H](CCc2c1)NC(=O)Nc1cccc2cnccc12