Reaction Details
TargetTransient receptor potential cation channel subfamily V member 1
LigandBDBM20284
Substrate/CompetitorBDBM20458
Meas. Tech.Radioligand Binding Assay and Antagonist Ca2+ Influx Functional Assay
pH7.4±n/a
Temperature298.15±n/a K
Ki 1288±209 nM
EC50 282±26 nM
Citation Bianchi, BREl Kouhen, RNeelands, TRLee, CHGomtsyan, ARaja, SNVaidyanathan, SNSurber, BMcDonald, HASurowy, CSFaltynek, CRMoreland, RBJarvis, MFPuttfarcken, PS [3H]A-778317 [1-((R)-5-tert-butyl-indan-1-yl)-3-isoquinolin-5-yl-urea]: a novel, stereoselective, high-affinity antagonist is a useful radioligand for the human transient receptor potential vanilloid-1 (TRPV1) receptor. J Pharmacol Exp Ther323:285-93 (2007) 
 
Transient receptor potential cation channel subfamily V member 1
Name:Transient receptor potential cation channel subfamily V member 1
Type:Protein
Mol. Mass.:94960.75
Organism:Homo sapiens (Human)
Description:Q8NER1
Residue:839
BDBM20284
BDBM20458
NameBDBM20284
Synonyms:CHEMBL391997 Capsazepine N-[2-(4-chlorophenyl)ethyl]-7,8-dihydroxy-2,3,4,5-tetrahydro-1H-2-benzazepine-2-carbothioamide
TypeSmall organic molecule
Emp. Form.C19H21ClN2O2S
Mol. Mass.376.9
SMILESOc1cc2CCCN(Cc2cc1O)C(=S)NCCc1ccc(Cl)cc1