Reaction Details
TargetTransient receptor potential cation channel subfamily V member 1
LigandBDBM20494
Substrate/CompetitorBDBM10852
Meas. Tech.FLIPR (Fluorescence Imaging Plate Reader)-Based Ca2+ Assay
pH7.2±n/a
Temperature298.15±n/a K
EC50 79±n/a nM
Citation Rami, HKThompson, MStemp, GFell, SJerman, JCStevens, AJSmart, DSargent, BSanderson, DRandall, ADGunthorpe, MJDavis, JB Discovery of SB-705498: a potent, selective and orally bioavailable TRPV1 antagonist suitable for clinical development. Bioorg Med Chem Lett16:3287-91 (2006) 
 
Transient receptor potential cation channel subfamily V member 1
Name:Transient receptor potential cation channel subfamily V member 1
Type:Protein
Mol. Mass.:94960.75
Organism:Homo sapiens (Human)
Description:Q8NER1
Residue:839
BDBM20494
BDBM10852
NameBDBM20494
Synonyms:1-(2-bromophenyl)-3-[2-(5-fluoro-2,3-dihydro-1H-indol-1-yl)ethyl]urea | dihydroindole derivative, 5
TypeSmall organic molecule
Emp. Form.C17H17BrFN3O
Mol. Mass.378.239
SMILESFc1ccc2N(CCNC(=O)Nc3ccccc3Br)CCc2c1