Reaction Details
TargetTransient receptor potential cation channel subfamily V member 1
LigandBDBM20554
Substrate/CompetitorBDBM10852
Meas. Tech.Capsaicin Antagonist Assay
IC50 0.57±n/a nM
Citation Doherty, EMFotsch, CBannon, AWBo, YChen, NDominguez, CFalsey, JGavva, NRKaton, JNixey, TOgnyanov, VIPettus, LRzasa, RMStec, MSurapaneni, STamir, RZhu, JTreanor, JJNorman, MH Novel vanilloid receptor-1 antagonists: 2. Structure-activity relationships of 4-oxopyrimidines leading to the selection of a clinical candidate. J Med Chem50:3515-27 (2007) 
 
Transient receptor potential cation channel subfamily V member 1
Name:Transient receptor potential cation channel subfamily V member 1
Type:Transient Receptor
Mol. Mass.:94956.12
Organism:Rattus norvegicus (rat)
Description:O35433
Residue:838
BDBM20554
BDBM10852
NameBDBM20554
Synonyms:3-amino-5-({6-[4-(trifluoromethyl)phenyl]pyrimidin-4-yl}oxy)-1,2-dihydroquinoxalin-2-one CHEMBL375681
TypeSmall organic molecule
Emp. Form.C19H12F3N5O2
Mol. Mass.399.3261
SMILESNc1nc2c(Oc3cc(ncn3)-c3ccc(cc3)C(F)(F)F)cccc2[nH]c1=O