Reaction Details
TargetHeat shock protein HSP 90-beta
LigandBDBM20756
Substrate/CompetitorBDBM10852
Meas. Tech.Her-2 Degradation Assay
pH7.2±n/a
Temperature310.15±n/a K
EC50 15000±n/a nM
CommentsEC50=20000 nM in MTS cell-growth inhibition assay.
Citation Zhang, LFan, JVu, KHong, KLe Brazidec, JYShi, JBiamonte, MBusch, DJLough, REGrecko, RRan, YSensintaffar, JLKamal, ALundgren, KBurrows, FJMansfield, RTimony, GAUlm, EHKasibhatla, SRBoehm, MF 7'-substituted benzothiazolothio- and pyridinothiazolothio-purines as potent heat shock protein 90 inhibitors. J Med Chem49:5352-62 (2006) 
 
Heat shock protein HSP 90-beta
Name:Heat shock protein HSP 90-beta
Type:Molecular Chaperone
Mol. Mass.:83229.45
Organism:Homo sapiens (Human)
Description:P08238
Residue:724
BDBM20756
BDBM10852
NameBDBM20756
Synonyms:9-butyl-8-[(4-chloro-1,3-benzothiazol-2-yl)sulfanyl]-9H-purin-6-amine | Benzothiazole analogue, 9
TypeSmall organic molecule
Emp. Form.C16H15ClN6S2
Mol. Mass.390.914
SMILESCCCCn1c(Sc2nc3c(Cl)cccc3s2)nc2c(N)ncnc12