Reaction Details
TargetHeat shock protein HSP 90-beta
LigandBDBM20769
Substrate/CompetitorBDBM10852
Meas. Tech.Her-2 Degradation Assay
pH7.2±n/a
Temperature310.15±n/a K
EC50 90±n/a nM
CommentsEC50=200 nM in MTS cell-growth inhibition assay.
Citation Zhang, LFan, JVu, KHong, KLe Brazidec, JYShi, JBiamonte, MBusch, DJLough, REGrecko, RRan, YSensintaffar, JLKamal, ALundgren, KBurrows, FJMansfield, RTimony, GAUlm, EHKasibhatla, SRBoehm, MF 7'-substituted benzothiazolothio- and pyridinothiazolothio-purines as potent heat shock protein 90 inhibitors. J Med Chem49:5352-62 (2006) 
 
Heat shock protein HSP 90-beta
Name:Heat shock protein HSP 90-beta
Type:Molecular Chaperone
Mol. Mass.:83229.45
Organism:Homo sapiens (Human)
Description:P08238
Residue:724
BDBM20769
BDBM10852
NameBDBM20769
Synonyms:3-{6-amino-8-[(7-chloro-1,3-benzothiazol-2-yl)sulfanyl]-9H-purin-9-yl}propyl acetate | Benzothiazole analogue, 22
TypeSmall organic molecule
Emp. Form.C17H15ClN6O2S2
Mol. Mass.434.923
SMILESCC(=O)OCCCn1c(Sc2nc3cccc(Cl)c3s2)nc2c(N)ncnc12