Reaction Details
TargetHeat shock protein HSP 90-beta
LigandBDBM20778
Substrate/CompetitorBDBM10852
Meas. Tech.Her-2 Degradation Assay
EC50 35±n/a nM
Citation Zhang, LFan, JVu, KHong, KLe Brazidec, JYShi, JBiamonte, MBusch, DJLough, REGrecko, RRan, YSensintaffar, JLKamal, ALundgren, KBurrows, FJMansfield, RTimony, GAUlm, EHKasibhatla, SRBoehm, MF 7'-substituted benzothiazolothio- and pyridinothiazolothio-purines as potent heat shock protein 90 inhibitors. J Med Chem49:5352-62 (2006) 
 
Heat shock protein HSP 90-beta
Name:Heat shock protein HSP 90-beta
Type:Molecular Chaperone
Mol. Mass.:83229.45
Organism:Homo sapiens (Human)
Description:P08238
Residue:724
BDBM20778
BDBM10852
NameBDBM20778
Synonyms:8-[(7-chloro-1,3-benzothiazol-2-yl)sulfanyl]-9-{2-[(2,2-dimethylpropyl)amino]ethyl}-9H-purin-6-amine CHEMBL215657
TypeSmall organic molecule
Emp. Form.C19H22ClN7S2
Mol. Mass.448.008
SMILESCC(C)(C)CNCCn1c(Sc2nc3cccc(Cl)c3s2)nc2c(N)ncnc12