Reaction Details
TargetDelta-type opioid receptor
LigandBDBM21010
Substrate/CompetitorBDBM21008
Meas. Tech.Radioligand Labeled Binding Assay and [35S]GTP-gamma-S Binding Assay
pH7.4±n/a
Temperature298.15±n/a K
Ki 10±n/a nM
EC50 17±n/a nM
Citation Yamamoto, TNair, PVagner, JLargent-Milnes, TDavis, PMa, SWNavratilova, EMoye, STumati, SLai, JYamamura, HIVanderah, TWPorreca, FHruby, VJ A Structure-Activity Relationship Study and Combinatorial Synthetic Approach of C-Terminal Modified Bifunctional Peptides That Are delta/mu Opioid Receptor Agonists and Neurokinin 1 Receptor Antagonists. J Med Chem51:1369-76 (2008) 
 
Delta-type opioid receptor
Name:Delta-type opioid receptor
Type:G Protein-Coupled Receptor (GPCR)
Mol. Mass.:40382.98
Organism:Homo sapiens (Human)
Description:Competition binding assays were carried out using membrane preparations from transfected HN9.10 cells that constitutively expressed the delta opioid receptor.
Residue:372
BDBM21010
BDBM21008
NameBDBM21010
Synonyms:(2S)-2-{[(2S)-1-[(2S)-2-{2-[(2R)-2-[(2S)-2-amino-3-(4-hydroxyphenyl)propanamido]propanamido]acetamido}-3-phenylpropanoyl]pyrrolidin-2-yl]formamido}-N-[(1S)-1-(benzylcarbamoyl)-2-(1H-indol-3-yl)ethyl]-4-methylpentanamide H-Tyr-D-Ala-Gly-Phe-Pro-Leu-Trp-NH-Bzl
TypePeptide-like ligand
Emp. Form.C52H63N9O8
Mol. Mass.942.1121
SMILESCC(C)C[C@H](NC(=O)[C@@H]1CCCN1C(=O)[C@H](Cc1ccccc1)NC(=O)CNC(=O)[C@@H](C)NC(=O)[C@@H](N)Cc1ccc(O)cc1)C(=O)N[C@@H](Cc1c[nH]c2ccccc12)C(=O)NCc1ccccc1