Reaction Details
TargetAdenosine receptor A2a
LigandBDBM21211
Substrate/CompetitorBDBM21190
Meas. Tech.Receptor Binding Assay
pH7.4±n/a
Temperature295.15±n/a K
Ki 2.1±0.2 nM
Citation Slee, DHMoorjani, MZhang, XLin, ELanier, MCChen, YRueter, JKLechner, SMMarkison, SMalany, SJoswig, TSantos, MGross, RSWilliams, JPCastro-Palomino, JCCrespo, MIPrat, MGual, SDíaz, JLJalali, KSai, YZuo, ZYang, CWen, JO'Brien, ZPetroski, RSaunders, J 2-Amino-N-pyrimidin-4-ylacetamides as A2A Receptor Antagonists: 2. Reduction of hERG Activity, Observed Species Selectivity, and Structure-Activity Relationships. J Med Chem51:1730-9 (2008) 
 
Adenosine receptor A2a
Name:Adenosine receptor A2a
Type:G Protein-Coupled Receptor (GPCR)
Mol. Mass.:44716.46
Organism:Homo sapiens (Human)
Description:P29274
Residue:412
BDBM21211
BDBM21190
NameBDBM21211
Synonyms:N-[6-(3,5-dimethyl-1H-pyrazol-1-yl)-2-(5-methylfuran-2-yl)pyrimidin-4-yl]-3-(dimethylamino)propanamide | Pyrimidin-4-ylacetamide, 26
TypeSmall organic molecule
Emp. Form.C19H24N6O2
Mol. Mass.368.4329
SMILESCN(C)CCC(=O)Nc1cc(nc(n1)-c1ccc(C)o1)-n1nc(C)cc1C