Reaction Details
TargetAdenosine receptor A3
LigandBDBM21216
Substrate/CompetitorBDBM21242
Meas. Tech.Human A1 Adenosine Receptor Binding Assay
Ki 955±n/a nM
Citation Cosimelli, BGreco, GEhlardo, MNovellino, EDa Settimo, FTaliani, SLa Motta, CBellandi, MTuccinardi, TMartinelli, ACiampi, OTrincavelli, MLMartini, C Derivatives of 4-Amino-6-hydroxy-2-mercaptopyrimidine as Novel, Potent, and Selective A3 Adenosine Receptor Antagonists. J Med Chem51:1764-70 (2008) 
 
Adenosine receptor A3
Name:Adenosine receptor A3
Type:G Protein-Coupled Receptor (GPCR)
Mol. Mass.:36197.32
Organism:Homo sapiens (Human)
Description:P0DMS8
Residue:318
BDBM21216
BDBM21242
NameBDBM21216
Synonyms:2-[4-(ethylsulfanyl)-1H-1,3-benzodiazol-2-yl]quinoxaline CHEMBL198008 | benzimidazole-quinoxaline, C2
TypeSmall organic molecule
Emp. Form.C17H14N4S
Mol. Mass.306.385
SMILESCCSc1cccc2nc([nH]c12)-c1cnc2ccccc2n1