Reaction Details
TargetAdenosine receptor A3
LigandBDBM21173
Substrate/CompetitorBDBM21242
Meas. Tech.Human A1 Adenosine Receptor Binding Assay
Ki>1000±n/a nM
Citation Cosimelli, BGreco, GEhlardo, MNovellino, EDa Settimo, FTaliani, SLa Motta, CBellandi, MTuccinardi, TMartinelli, ACiampi, OTrincavelli, MLMartini, C Derivatives of 4-Amino-6-hydroxy-2-mercaptopyrimidine as Novel, Potent, and Selective A3 Adenosine Receptor Antagonists. J Med Chem51:1764-70 (2008) 
 
Adenosine receptor A3
Name:Adenosine receptor A3
Type:G Protein-Coupled Receptor (GPCR)
Mol. Mass.:36197.32
Organism:Homo sapiens (Human)
Description:P0DMS8
Residue:318
BDBM21173
BDBM21242
NameBDBM21173
Synonyms:1,3-dipropyl-8-cyclopentylxanthine CHEMBL183 PD116948 | [3H]DPCPX
Typeradiolabeled ligand
Emp. Form.C16H24N4O2
Mol. Mass.304.3874
SMILESCCCn1c2nc([nH]c2c(=O)n(CCC)c1=O)C1CCCC1