Reaction Details
TargetCannabinoid receptor 1
LigandBDBM21254
Substrate/CompetitorBDBM21244
Meas. Tech.CB Receptor Binding Assay
pH7.4±n/a
Temperature303.15±n/a K
Ki 2820±n/a nM
Citation Silvestri, RCascio, MGLa Regina, GPiscitelli, FLavecchia, ABrizzi, APasquini, SBotta, MNovellino, EDi Marzo, VCorelli, F Synthesis, Cannabinoid Receptor Affinity, and Molecular Modeling Studies of Substituted 1-Aryl-5-(1H-pyrrol-1-yl)-1H-pyrazole-3-carboxamides. J Med Chem51:1560-76 (2008) 
 
Cannabinoid receptor 1
Name:Cannabinoid receptor 1
Type:G Protein-Coupled Receptor (GPCR)
Mol. Mass.:52868.96
Organism:Homo sapiens (Human)
Description:P21554
Residue:472
BDBM21254
BDBM21244
NameBDBM21254
Synonyms:1-(4-chlorophenyl)-N-[(3,4-dichlorophenyl)methyl]-3-methyl-5-(1H-pyrrol-1-yl)-1H-pyrazole-4-carboxamide | Pyrazole-4-carboxamide analogue, 21
TypeSmall organic molecule
Emp. Form.C22H17Cl3N4O
Mol. Mass.459.756
SMILESCc1nn(c(c1C(=O)NCc1ccc(Cl)c(Cl)c1)-n1cccc1)-c1ccc(Cl)cc1