Reaction Details
TargetCannabinoid receptor 1
LigandBDBM21266
Substrate/CompetitorBDBM21244
Meas. Tech.CB Receptor Binding Assay
pH7.4±n/a
Temperature303.15±n/a K
Ki 14±n/a nM
Citation Silvestri, RCascio, MGLa Regina, GPiscitelli, FLavecchia, ABrizzi, APasquini, SBotta, MNovellino, EDi Marzo, VCorelli, F Synthesis, Cannabinoid Receptor Affinity, and Molecular Modeling Studies of Substituted 1-Aryl-5-(1H-pyrrol-1-yl)-1H-pyrazole-3-carboxamides. J Med Chem51:1560-76 (2008) 
 
Cannabinoid receptor 1
Name:Cannabinoid receptor 1
Type:G Protein-Coupled Receptor (GPCR)
Mol. Mass.:52868.96
Organism:Homo sapiens (Human)
Description:P21554
Residue:472
BDBM21266
BDBM21244
NameBDBM21266
Synonyms:N-cyclohexyl-1-(3,4-dichlorophenyl)-5-(2,5-dimethyl-1H-pyrrol-1-yl)-4-methyl-1H-pyrazole-3-carboxamide | Pyrazole-3-carboxamide analogue, 33
TypeSmall organic molecule
Emp. Form.C23H26Cl2N4O
Mol. Mass.445.385
SMILESCc1ccc(C)n1-c1c(C)c(nn1-c1ccc(Cl)c(Cl)c1)C(=O)NC1CCCCC1