Reaction Details
TargetCannabinoid receptor 1
LigandBDBM21268
Substrate/CompetitorBDBM21244
Meas. Tech.CB Receptor Binding Assay
pH7.4±n/a
Temperature303.15±n/a K
Ki>2820±n/a nM
Citation Silvestri, RCascio, MGLa Regina, GPiscitelli, FLavecchia, ABrizzi, APasquini, SBotta, MNovellino, EDi Marzo, VCorelli, F Synthesis, Cannabinoid Receptor Affinity, and Molecular Modeling Studies of Substituted 1-Aryl-5-(1H-pyrrol-1-yl)-1H-pyrazole-3-carboxamides. J Med Chem51:1560-76 (2008) 
 
Cannabinoid receptor 1
Name:Cannabinoid receptor 1
Type:G Protein-Coupled Receptor (GPCR)
Mol. Mass.:52868.96
Organism:Homo sapiens (Human)
Description:P21554
Residue:472
BDBM21268
BDBM21244
NameBDBM21268
Synonyms:1-(2,4-difluorophenyl)-4-methyl-N-(morpholin-4-yl)-5-(1H-pyrrol-1-yl)-1H-pyrazole-3-carboxamide | Pyrazole-3-carboxamide analogue, 35
TypeSmall organic molecule
Emp. Form.C19H19F2N5O2
Mol. Mass.387.3833
SMILESCc1c(nn(c1-n1cccc1)-c1ccc(F)cc1F)C(=O)NN1CCOCC1