Reaction Details
TargetCannabinoid receptor 1
LigandBDBM21272
Substrate/CompetitorBDBM21244
Meas. Tech.CB Receptor Binding Assay
pH7.4±n/a
Temperature303.15±n/a K
Ki 35±n/a nM
Citation Silvestri, RCascio, MGLa Regina, GPiscitelli, FLavecchia, ABrizzi, APasquini, SBotta, MNovellino, EDi Marzo, VCorelli, F Synthesis, Cannabinoid Receptor Affinity, and Molecular Modeling Studies of Substituted 1-Aryl-5-(1H-pyrrol-1-yl)-1H-pyrazole-3-carboxamides. J Med Chem51:1560-76 (2008) 
 
Cannabinoid receptor 1
Name:Cannabinoid receptor 1
Type:G Protein-Coupled Receptor (GPCR)
Mol. Mass.:52868.96
Organism:Homo sapiens (Human)
Description:P21554
Residue:472
BDBM21272
BDBM21244
NameBDBM21272
Synonyms:N-[(3,4-dichlorophenyl)methyl]-1-(2,4-difluorophenyl)-5-(2,5-dimethyl-1H-pyrrol-1-yl)-4-methyl-1H-pyrazole-3-carboxamide | Pyrazole-3-carboxamide analogue, 39
TypeSmall organic molecule
Emp. Form.C24H20Cl2F2N4O
Mol. Mass.489.345
SMILESCc1ccc(C)n1-c1c(C)c(nn1-c1ccc(F)cc1F)C(=O)NCc1ccc(Cl)c(Cl)c1