Reaction Details
TargetCannabinoid receptor 1
LigandBDBM21276
Substrate/CompetitorBDBM21244
Meas. Tech.CB Receptor Binding Assay
Ki 110±n/a nM
Citation Silvestri, RCascio, MGLa Regina, GPiscitelli, FLavecchia, ABrizzi, APasquini, SBotta, MNovellino, EDi Marzo, VCorelli, F Synthesis, Cannabinoid Receptor Affinity, and Molecular Modeling Studies of Substituted 1-Aryl-5-(1H-pyrrol-1-yl)-1H-pyrazole-3-carboxamides. J Med Chem51:1560-76 (2008) 
 
Cannabinoid receptor 1
Name:Cannabinoid receptor 1
Type:G Protein-Coupled Receptor (GPCR)
Mol. Mass.:52868.96
Organism:Homo sapiens (Human)
Description:P21554
Residue:472
BDBM21276
BDBM21244
NameBDBM21276
Synonyms:5-(2,5-dimethyl-1H-pyrrol-1-yl)-4-methyl-N-(piperidin-1-yl)-1-(2,4,6-trichlorophenyl)-1H-pyrazole-3-carboxamide | Pyrazole-3-carboxamide analogue, 43
TypeSmall organic molecule
Emp. Form.C22H24Cl3N5O
Mol. Mass.480.818
SMILESCc1ccc(C)n1-c1c(C)c(nn1-c1c(Cl)cc(Cl)cc1Cl)C(=O)NN1CCCCC1