Reaction Details
TargetCannabinoid receptor 2
LigandBDBM21251
Substrate/CompetitorBDBM21244
Meas. Tech.CB Receptor Binding Assay
Ki 390±n/a nM
Citation Silvestri, RCascio, MGLa Regina, GPiscitelli, FLavecchia, ABrizzi, APasquini, SBotta, MNovellino, EDi Marzo, VCorelli, F Synthesis, Cannabinoid Receptor Affinity, and Molecular Modeling Studies of Substituted 1-Aryl-5-(1H-pyrrol-1-yl)-1H-pyrazole-3-carboxamides. J Med Chem51:1560-76 (2008) 
 
Cannabinoid receptor 2
Name:Cannabinoid receptor 2
Type:G Protein-Coupled Receptor (GPCR)
Mol. Mass.:39690.94
Organism:Homo sapiens (Human)
Description:P34972
Residue:360
BDBM21251
BDBM21244
NameBDBM21251
Synonyms:1-(4-chlorophenyl)-N-(cyclohexylmethyl)-4-methyl-5-(1H-pyrrol-1-yl)-1H-pyrazole-3-carboxamide | Pyrazole-3-carboxamide analogue, 18
TypeSmall organic molecule
Emp. Form.C22H25ClN4O
Mol. Mass.396.913
SMILESCc1c(nn(c1-n1cccc1)-c1ccc(Cl)cc1)C(=O)NCC1CCCCC1