Reaction Details
TargetCannabinoid receptor 2
LigandBDBM21274
Substrate/CompetitorBDBM21244
Meas. Tech.CB Receptor Binding Assay
Ki>3940±n/a nM
Citation Silvestri, RCascio, MGLa Regina, GPiscitelli, FLavecchia, ABrizzi, APasquini, SBotta, MNovellino, EDi Marzo, VCorelli, F Synthesis, Cannabinoid Receptor Affinity, and Molecular Modeling Studies of Substituted 1-Aryl-5-(1H-pyrrol-1-yl)-1H-pyrazole-3-carboxamides. J Med Chem51:1560-76 (2008) 
 
Cannabinoid receptor 2
Name:Cannabinoid receptor 2
Type:G Protein-Coupled Receptor (GPCR)
Mol. Mass.:39690.94
Organism:Homo sapiens (Human)
Description:P34972
Residue:360
BDBM21274
BDBM21244
NameBDBM21274
Synonyms:4-methyl-N-(piperidin-1-yl)-5-(1H-pyrrol-1-yl)-1-(2,4,6-trichlorophenyl)-1H-pyrazole-3-carboxamide | Pyrazole-3-carboxamide analogue, 41
TypeSmall organic molecule
Emp. Form.C20H20Cl3N5O
Mol. Mass.452.765
SMILESCc1c(nn(c1-n1cccc1)-c1c(Cl)cc(Cl)cc1Cl)C(=O)NN1CCCCC1