Reaction Details
TargetCannabinoid receptor 2
LigandBDBM21277
Substrate/CompetitorBDBM21244
Meas. Tech.CB Receptor Binding Assay
Ki 390±n/a nM
Citation Silvestri, RCascio, MGLa Regina, GPiscitelli, FLavecchia, ABrizzi, APasquini, SBotta, MNovellino, EDi Marzo, VCorelli, F Synthesis, Cannabinoid Receptor Affinity, and Molecular Modeling Studies of Substituted 1-Aryl-5-(1H-pyrrol-1-yl)-1H-pyrazole-3-carboxamides. J Med Chem51:1560-76 (2008) 
 
Cannabinoid receptor 2
Name:Cannabinoid receptor 2
Type:G Protein-Coupled Receptor (GPCR)
Mol. Mass.:39690.94
Organism:Homo sapiens (Human)
Description:P34972
Residue:360
BDBM21277
BDBM21244
NameBDBM21277
Synonyms:N-cyclohexyl-5-(2,5-dimethyl-1H-pyrrol-1-yl)-4-methyl-1-(2,4,6-trichlorophenyl)-1H-pyrazole-3-carboxamide | Pyrazole-3-carboxamide analogue, 44
TypeSmall organic molecule
Emp. Form.C23H25Cl3N4O
Mol. Mass.479.83
SMILESCc1ccc(C)n1-c1c(C)c(nn1-c1c(Cl)cc(Cl)cc1Cl)C(=O)NC1CCCCC1