Reaction Details
Target5-hydroxytryptamine receptor 6
LigandBDBM21346
Substrate/CompetitorBDBM21342
Meas. Tech.Radioligand Labeled Binding Assay
pH7.4±n/a
Temperature295.15±n/a K
Ki 21±2 nM
Citation Cole, DCStock, JRLennox, WJBernotas, RCEllingboe, JWBoikess, SCoupet, JSmith, DLLeung, LZhang, GMFeng, XKelly, MFGalante, RHuang, PDawson, LAMarquis, KRosenzweig-Lipson, SBeyer, CESchechter, LE Discovery of N1-(6-chloroimidazo[2,1-b][1,3]thiazole-5-sulfonyl)tryptamine as a potent, selective, and orally active 5-HT(6) receptor agonist. J Med Chem50:5535-8 (2007) 
 
5-hydroxytryptamine receptor 6
Name:5-hydroxytryptamine receptor 6
Type:G Protein-Coupled Receptor (GPCR)
Mol. Mass.:46968.43
Organism:Homo sapiens (Human)
Description:P50406
Residue:440
BDBM21346
BDBM21342
NameBDBM21346
Synonyms:2-{1-[(4-fluorobenzene)sulfonyl]-1H-indol-3-yl}ethan-1-amine | Substituted phenylsulfonyltryptamine, 11e
TypeSmall organic molecule
Emp. Form.C16H15FN2O2S
Mol. Mass.318.366
SMILESNCCc1cn(c2ccccc12)S(=O)(=O)c1ccc(F)cc1