Reaction Details
Target5-hydroxytryptamine receptor 6
LigandBDBM21357
Substrate/CompetitorBDBM21342
Meas. Tech.Radioligand Labeled Binding Assay and cAMP Production
pH7.4±n/a
Temperature295.15±n/a K
Ki 10±1 nM
EC50 9.6±1 nM
CommentsAntagonism of 5-HT stimulated cAMP production.
Citation Cole, DCStock, JRLennox, WJBernotas, RCEllingboe, JWBoikess, SCoupet, JSmith, DLLeung, LZhang, GMFeng, XKelly, MFGalante, RHuang, PDawson, LAMarquis, KRosenzweig-Lipson, SBeyer, CESchechter, LE Discovery of N1-(6-chloroimidazo[2,1-b][1,3]thiazole-5-sulfonyl)tryptamine as a potent, selective, and orally active 5-HT(6) receptor agonist. J Med Chem50:5535-8 (2007) 
 
5-hydroxytryptamine receptor 6
Name:5-hydroxytryptamine receptor 6
Type:G Protein-Coupled Receptor (GPCR)
Mol. Mass.:46968.43
Organism:Homo sapiens (Human)
Description:P50406
Residue:440
BDBM21357
BDBM21342
NameBDBM21357
Synonyms:5-thiazolylsulfonyl tryptamine, 11p | 5-{[3-(2-aminoethyl)-1H-indole-1-]sulfonyl}-4-methyl-1,3-thiazol-2-amine
TypeSmall organic molecule
Emp. Form.C14H16N4O2S2
Mol. Mass.336.432
SMILESCc1nc(N)sc1S(=O)(=O)n1cc(CCN)c2ccccc12