Reaction Details
TargetCytochrome P450 2A6
LigandBDBM21358
Substrate/CompetitorBDBM12342
Meas. Tech.Cytochrome P450 Inhibition
pH7.4±n/a
Temperature310.15±n/a K
IC50 41000±n/a nM
Citation Cole, DCStock, JRLennox, WJBernotas, RCEllingboe, JWBoikess, SCoupet, JSmith, DLLeung, LZhang, GMFeng, XKelly, MFGalante, RHuang, PDawson, LAMarquis, KRosenzweig-Lipson, SBeyer, CESchechter, LE Discovery of N1-(6-chloroimidazo[2,1-b][1,3]thiazole-5-sulfonyl)tryptamine as a potent, selective, and orally active 5-HT(6) receptor agonist. J Med Chem50:5535-8 (2007) 
 
Cytochrome P450 2A6
Name:Cytochrome P450 2A6
Type:Protein
Mol. Mass.:56514.34
Organism:Homo sapiens (Human)
Description:P11509
Residue:494
BDBM21358
BDBM12342
NameBDBM21358
Synonyms:2-[1-({6-chloroimidazo[2,1-b][1,3]thiazole-5-}sulfonyl)-1H-indol-3-yl]ethan-1-amine SAX-187 | WAY-181187
TypeSmall organic molecule
Emp. Form.C15H13ClN4O2S2
Mol. Mass.380.872
SMILESNCCc1cn(c2ccccc12)S(=O)(=O)c1c(Cl)nc2sccn12