Reaction Details
Target5-hydroxytryptamine receptor 6
LigandBDBM21364
Substrate/CompetitorBDBM21342
Meas. Tech.Radioligand Labeled Binding Assay
pH7.4±n/a
Temperature295.15±n/a K
Ki 25±n/a nM
Citation Cole, DCStock, JRLennox, WJBernotas, RCEllingboe, JWBoikess, SCoupet, JSmith, DLLeung, LZhang, GMFeng, XKelly, MFGalante, RHuang, PDawson, LAMarquis, KRosenzweig-Lipson, SBeyer, CESchechter, LE Discovery of N1-(6-chloroimidazo[2,1-b][1,3]thiazole-5-sulfonyl)tryptamine as a potent, selective, and orally active 5-HT(6) receptor agonist. J Med Chem50:5535-8 (2007) 
 
5-hydroxytryptamine receptor 6
Name:5-hydroxytryptamine receptor 6
Type:G Protein-Coupled Receptor (GPCR)
Mol. Mass.:46968.43
Organism:Homo sapiens (Human)
Description:P50406
Residue:440
BDBM21364
BDBM21342
NameBDBM21364
Synonyms:3-[(E)-[(5-bromo-1H-indol-3-yl)methylidene]amino]guanidine | 5-bromoindole aminoguanidine, 6
TypeSmall organic molecule
Emp. Form.C10H10BrN5
Mol. Mass.280.124
SMILESNC(N)=NN=Cc1c[nH]c2ccc(Br)cc12