Reaction Details
Target5-hydroxytryptamine receptor 6
LigandBDBM21366
Substrate/CompetitorBDBM21342
Meas. Tech.Radioligand Labeled Binding Assay
pH7.4±n/a
Temperature295.15±n/a K
Ki 10.3±n/a nM
Comments5HT6 partial agonist.
Citation Cole, DCStock, JRLennox, WJBernotas, RCEllingboe, JWBoikess, SCoupet, JSmith, DLLeung, LZhang, GMFeng, XKelly, MFGalante, RHuang, PDawson, LAMarquis, KRosenzweig-Lipson, SBeyer, CESchechter, LE Discovery of N1-(6-chloroimidazo[2,1-b][1,3]thiazole-5-sulfonyl)tryptamine as a potent, selective, and orally active 5-HT(6) receptor agonist. J Med Chem50:5535-8 (2007) 
 
5-hydroxytryptamine receptor 6
Name:5-hydroxytryptamine receptor 6
Type:G Protein-Coupled Receptor (GPCR)
Mol. Mass.:46968.43
Organism:Homo sapiens (Human)
Description:P50406
Residue:440
BDBM21366
BDBM21342
NameBDBM21366
Synonyms:(2-{3-[(3-fluorobenzene)sulfonyl]-1H-indol-1-yl}ethyl)dimethylamine flipped tryptamine derivative, 10
TypeSmall organic molecule
Emp. Form.C18H19FN2O2S
Mol. Mass.346.419
SMILESCN(C)CCn1cc(c2ccccc12)S(=O)(=O)c1cccc(F)c1