Reaction Details
TargetAngiotensin-converting enzyme 2
LigandBDBM21485
Substrate/CompetitorBDBM21453
Meas. Tech.Enzyme Inhibition Assay
pH6.5±n/a
Temperature295.15±n/a K
IC50 290±n/a nM
Citation Dales, NAGould, AEBrown, JACalderwood, EFGuan, BMinor, CAGavin, JMHales, PKaushik, VKStewart, MTummino, PJVickers, CSOcain, TDPatane, MA Substrate-based design of the first class of angiotensin-converting enzyme-related carboxypeptidase (ACE2) inhibitors. J Am Chem Soc124:11852-3 (2002) 
 
Angiotensin-converting enzyme 2
Name:Angiotensin-converting enzyme 2
Type:Enzyme
Mol. Mass.:92448.86
Organism:Homo sapiens (Human)
Description:n/a
Residue:805
BDBM21485
BDBM21453
NameBDBM21485
Synonyms:(2S)-2-{[(1S)-1-carboxy-2-{1-[(2-methylphenyl)methyl]-1H-imidazol-5-yl}ethyl]amino}-4-methylpentanoic acid | Amino dicarboxylate analogue, 12
TypeSmall organic molecule
Emp. Form.C20H27N3O4
Mol. Mass.373.4461
SMILESCC(C)C[C@H](N[C@@H](Cc1cncn1Cc1ccccc1C)C(O)=O)C(O)=O