Reaction Details
TargetProstaglandin D2 receptor 2
LigandBDBM21569
Substrate/CompetitorBDBM21544
Meas. Tech.Radioligand Binding Assay
pH7.4±n/a
Temperature295.15±n/a K
Ki 115±52 nM
Citation Crosignani, SPage, PMissotten, MColovray, VCleva, CArrighi, JFAtherall, JMacritchie, JMartin, THumbert, YGaudet, MPupowicz, DMaio, MPittet, PAGolzio, LGiachetti, CRocha, CBernardinelli, GFilinchuk, YScheer, ASchwarz, MKChollet, A Discovery of a New Class of Potent, Selective, and Orally Bioavailable CRTH2 (DP2) Receptor Antagonists for the Treatment of Allergic Inflammatory Diseases. J Med Chem51:2227-2243 (2008) 
 
Prostaglandin D2 receptor 2
Name:Prostaglandin D2 receptor 2
Type:Enzyme
Mol. Mass.:43295.45
Organism:Homo sapiens (Human)
Description:Q9Y5Y4
Residue:395
BDBM21569
BDBM21544
NameBDBM21569
Synonyms:2-{5-chloro-1'-[(4-chlorophenyl)methyl]-1,2-dihydrospiro[indole-3,3'-pyrrolidine]-2,2',5'-trione}acetic acid | Spiro-indolinone analogue, 61
TypeSmall organic molecule
Emp. Form.C20H14Cl2N2O5
Mol. Mass.433.242
SMILESOC(=O)CN1C(=O)C2(CC(=O)N(Cc3ccc(Cl)cc3)C2=O)c2cc(Cl)ccc12