Reaction Details
TargetProstaglandin D2 receptor 2
LigandBDBM21584
Substrate/CompetitorBDBM21544
Meas. Tech.Radioligand Binding Assay
Ki 38±n/a nM
EC50 236±n/a nM
Citation Crosignani, SPage, PMissotten, MColovray, VCleva, CArrighi, JFAtherall, JMacritchie, JMartin, THumbert, YGaudet, MPupowicz, DMaio, MPittet, PAGolzio, LGiachetti, CRocha, CBernardinelli, GFilinchuk, YScheer, ASchwarz, MKChollet, A Discovery of a New Class of Potent, Selective, and Orally Bioavailable CRTH2 (DP2) Receptor Antagonists for the Treatment of Allergic Inflammatory Diseases. J Med Chem51:2227-2243 (2008) 
 
Prostaglandin D2 receptor 2
Name:Prostaglandin D2 receptor 2
Type:Enzyme
Mol. Mass.:43295.45
Organism:Homo sapiens (Human)
Description:Q9Y5Y4
Residue:395
BDBM21584
BDBM21544
NameBDBM21584
Synonyms:2-{5-chloro-1'-[(2-methyl-1,3-thiazol-4-yl)methyl]-1,2-dihydrospiro[indole-3,3'-pyrrolidine]-2,2',5'-trione}acetic acid | Spiro-indolinone analogue, 76
TypeSmall organic molecule
Emp. Form.C18H14ClN3O5S
Mol. Mass.419.839
SMILESCc1nc(CN2C(=O)CC3(C2=O)C(=O)N(CC(O)=O)c2ccc(Cl)cc32)cs1