Reaction Details
TargetProstaglandin D2 receptor 2
LigandBDBM21587
Substrate/CompetitorBDBM21544
Meas. Tech.Radioligand Binding Assay and [35S] GTP-gamma-S Binding Assay
Ki 212±n/a nM
Citation Crosignani, SPage, PMissotten, MColovray, VCleva, CArrighi, JFAtherall, JMacritchie, JMartin, THumbert, YGaudet, MPupowicz, DMaio, MPittet, PAGolzio, LGiachetti, CRocha, CBernardinelli, GFilinchuk, YScheer, ASchwarz, MKChollet, A Discovery of a New Class of Potent, Selective, and Orally Bioavailable CRTH2 (DP2) Receptor Antagonists for the Treatment of Allergic Inflammatory Diseases. J Med Chem51:2227-2243 (2008) 
 
Prostaglandin D2 receptor 2
Name:Prostaglandin D2 receptor 2
Type:Enzyme
Mol. Mass.:43295.45
Organism:Homo sapiens (Human)
Description:Q9Y5Y4
Residue:395
BDBM21587
BDBM21544
NameBDBM21587
Synonyms:2-(5-chloro-1'-{[5-(4-methoxyphenyl)-1,2,4-oxadiazol-3-yl]methyl}-1,2-dihydrospiro[indole-3,3'-pyrrolidine]-2,2',5'-trione)acetic acid | Spiro-indolinone analogue, 79
TypeSmall organic molecule
Emp. Form.C23H17ClN4O7
Mol. Mass.496.857
SMILESCOc1ccc(cc1)-c1nc(CN2C(=O)CC3(C2=O)C(=O)N(CC(O)=O)c2ccc(Cl)cc32)no1