Reaction Details
TargetProstaglandin D2 receptor 2
LigandBDBM21594
Substrate/CompetitorBDBM21544
Meas. Tech.Radioligand Binding Assay
Ki 7.6±n/a nM
EC50 21±n/a nM
Citation Crosignani, SPage, PMissotten, MColovray, VCleva, CArrighi, JFAtherall, JMacritchie, JMartin, THumbert, YGaudet, MPupowicz, DMaio, MPittet, PAGolzio, LGiachetti, CRocha, CBernardinelli, GFilinchuk, YScheer, ASchwarz, MKChollet, A Discovery of a New Class of Potent, Selective, and Orally Bioavailable CRTH2 (DP2) Receptor Antagonists for the Treatment of Allergic Inflammatory Diseases. J Med Chem51:2227-2243 (2008) 
 
Prostaglandin D2 receptor 2
Name:Prostaglandin D2 receptor 2
Type:Enzyme
Mol. Mass.:43295.45
Organism:Homo sapiens (Human)
Description:Q9Y5Y4
Residue:395
BDBM21594
BDBM21544
NameBDBM21594
Synonyms:2-{5-chloro-1'-[(5-methyl-3-phenyl-1,2-oxazol-4-yl)methyl]-1,2-dihydrospiro[indole-3,3'-pyrrolidine]-2,2',5'-trione}acetic acid | Spiro-indolinone analogue, 86
TypeSmall organic molecule
Emp. Form.C24H18ClN3O6
Mol. Mass.479.869
SMILESCc1onc(c1CN1C(=O)CC2(C1=O)C(=O)N(CC(O)=O)c1ccc(Cl)cc21)-c1ccccc1