Reaction Details
TargetProstaglandin D2 receptor 2
LigandBDBM21611
Substrate/CompetitorBDBM21544
Meas. Tech.Radioligand Binding Assay and [35S] GTP-gamma-S Binding Assay
Ki 88±n/a nM
Citation Crosignani, SPage, PMissotten, MColovray, VCleva, CArrighi, JFAtherall, JMacritchie, JMartin, THumbert, YGaudet, MPupowicz, DMaio, MPittet, PAGolzio, LGiachetti, CRocha, CBernardinelli, GFilinchuk, YScheer, ASchwarz, MKChollet, A Discovery of a New Class of Potent, Selective, and Orally Bioavailable CRTH2 (DP2) Receptor Antagonists for the Treatment of Allergic Inflammatory Diseases. J Med Chem51:2227-2243 (2008) 
 
Prostaglandin D2 receptor 2
Name:Prostaglandin D2 receptor 2
Type:G Protein-Coupled Receptor (GPCR)
Mol. Mass.:42975.89
Organism:Mus musculus (mouse)
Description:Human embryonic kidney (HEK) 293(EBNA) cells were transfected with mouse CRTH2.
Residue:382
BDBM21611
BDBM21544
NameBDBM21611
Synonyms:2-[(3S)-5-chloro-1'-[(5-chloro-2-fluorophenyl)methyl]-1,2-dihydrospiro[indole-3,3'-pyrrolidine]-2,5'-dione]acetic acid | Spiro-indolinone analogue, (S)-90
TypeSmall organic molecule
Emp. Form.C20H15Cl2FN2O4
Mol. Mass.437.249
SMILESOC(=O)CN1C(=O)[C@]2(CN(Cc3cc(Cl)ccc3F)C(=O)C2)c2cc(Cl)ccc12