Reaction Details
TargetBile acid receptor
LigandBDBM21717
Substrate/CompetitorBDBM10852
Meas. Tech.Cotransfection Assay
pH7.2±n/a
Temperature310.15±n/a K
EC50 1300±n/a nM
Citation Kainuma, MMakishima, MHashimoto, YMiyachi, H Design, synthesis, and evaluation of non-steroidal farnesoid X receptor (FXR) antagonist. Bioorg Med Chem15:2587-600 (2007) 
 
Bile acid receptor
Name:Bile acid receptor
Type:Nuclear Receptor
Mol. Mass.:55916.24
Organism:Homo sapiens (Human)
Description:Q96RI1
Residue:486
BDBM21717
BDBM10852
NameBDBM21717
Synonyms:3-[(E)-2-(4-{[5-tert-butyl-3-(2,6-dichlorophenyl)-1,2-oxazol-4-yl]methoxy}-2-chlorophenyl)ethenyl]benzoic acid | Isoxazole derivative, 10d
TypeSmall organic molecule
Emp. Form.C29H24Cl3NO4
Mol. Mass.556.864
SMILESCC(C)(C)c1onc(c1COc1ccc(\C=C\c2cccc(c2)C(O)=O)c(Cl)c1)-c1c(Cl)cccc1Cl