Reaction Details
TargetBile acid receptor
LigandBDBM21719
Substrate/CompetitorBDBM10852
Meas. Tech.Cotransfection Assay
pH7.2±n/a
Temperature310.15±n/a K
EC50 22200±n/a nM
CommentsAntagonist activity.
Citation Kainuma, MMakishima, MHashimoto, YMiyachi, H Design, synthesis, and evaluation of non-steroidal farnesoid X receptor (FXR) antagonist. Bioorg Med Chem15:2587-600 (2007) 
 
Bile acid receptor
Name:Bile acid receptor
Type:Nuclear Receptor
Mol. Mass.:55916.24
Organism:Homo sapiens (Human)
Description:Q96RI1
Residue:486
BDBM21719
BDBM10852
NameBDBM21719
Synonyms:3-[(E)-2-(2-chloro-4-{[3-(2,6-dichlorophenyl)-5-(naphthalen-2-yl)-1,2-oxazol-4-yl]methoxy}phenyl)ethenyl]benzoic acid | Isoxazole derivative, 10f
TypeSmall organic molecule
Emp. Form.C35H22Cl3NO4
Mol. Mass.626.912
SMILESOC(=O)c1cccc(\C=C\c2ccc(OCc3c(noc3-c3ccc4ccccc4c3)-c3c(Cl)cccc3Cl)cc2Cl)c1