Reaction Details
TargetBile acid receptor
LigandBDBM21721
Substrate/CompetitorBDBM10852
Meas. Tech.Cotransfection Assay
pH7.2±n/a
Temperature310.15±n/a K
EC50 1300±n/a nM
Citation Kainuma, MMakishima, MHashimoto, YMiyachi, H Design, synthesis, and evaluation of non-steroidal farnesoid X receptor (FXR) antagonist. Bioorg Med Chem15:2587-600 (2007) 
 
Bile acid receptor
Name:Bile acid receptor
Type:Nuclear Receptor
Mol. Mass.:55916.24
Organism:Homo sapiens (Human)
Description:Q96RI1
Residue:486
BDBM21721
BDBM10852
NameBDBM21721
Synonyms:3-[(4-{[5-tert-butyl-3-(2,6-dichlorophenyl)-1,2-oxazol-4-yl]methoxy}-2-chlorobenzene)amido]benzoic acid | Isoxazole derivative, 15f
TypeSmall organic molecule
Emp. Form.C28H23Cl3N2O5
Mol. Mass.573.852
SMILESCC(C)(C)c1onc(c1COc1ccc(C(=O)Nc2cccc(c2)C(O)=O)c(Cl)c1)-c1c(Cl)cccc1Cl